site stats

Gradlew failed

WebFeb 20, 2024 · After running this command, check your directory for the gradlew and gradlew.bat files. gradlew is the shell script file, and it can be used in Linux and macOS. … http://duoduokou.com/android/50897520985360702641.html

Azure DevOps - Android : Error: D:\a\1\s\gradlew.bat failed with …

Web使用Docker构建时提示异常信息为:ERROR: docker pull image failed, dockerImage? - 网络异常导致,可以通过以下方法处理: 1.重试确认是否能解决,如果拉取失败的镜像是dockerHub镜像且重试无法解决,可参考拉取dockerHub镜像超时或失败。 iready world record https://vrforlimbcare.com

[Solved] Command failed: gradlew.bat installDebug

Web从root运行 subapp1 子项目中的 MyTest test的命令是:. ./gradlew subapp1:test --tests MyTest. 编辑:混淆的来源是:. 运行 ./gradlew -q projects 时,Gradle报告子项目时会使用前导: 字符。. 请勿在命令中使用该字符。. 展开查看全部. 赞 (0) 分享 回复 (0) 22分钟前. … WebNov 4, 2024 · Solution 1 How I solved this problem: First, make sure that I have %java_home% variable set and also %path% has the java sdk included. How to setup Java environment variables Second, Go to your … http://duoduokou.com/android/50897520985360702641.html iready what is it

Troubleshooting builds - Gradle

Category:gradlew failed! · Issue #1489 · kivy/buildozer · GitHub

Tags:Gradlew failed

Gradlew failed

buildozer kivy build failled: armeabi-v7a gradlew failed - Google …

WebTroubleshooting Gradle installation. If you followed the installation instructions, and aren’t able to execute your Gradle build, here are some tips that may help. If you installed Gradle outside of just invoking the … WebAug 19, 2024 · What I thought is that the rerun-tasks flag would disable this check and the problem would be fixed. This was not the case. I also tried ./gradlew clean and removing the cache folder in the Gradle home directory. Here is the full stack trace of the issue: FAILURE: Build failed with an exception.

Gradlew failed

Did you know?

WebFeb 15, 2024 · FAILURE: Build failed with an exception. * What went wrong: Task 'setupDecompWorkspace' not found in root project 'Build'. * Try: Run gradlew tasks to get a list of available tasks. Run with --stacktrace option to get the stack trace. Run with --info or --debug option to get more log output. Run with --scan to get full insights. WebYou can try some of the following options: - changing the IDE settings. - changing the JAVA_HOME environment variable. - changing `org.gradle.java.home` in `gradle.properties`. * Try: > Run with --stacktrace option to get the stack trace. > Run with --info or --debug option to get more log output. > Run with --scan to get full insights.

WebMay 19, 2024 · * What went wrong: Execution failed for task ':packageDebug'. > org.gradle.tooling.BuildException (no error message) * Try: Run with --stacktrace option to get the stack trace. Run with --info or... WebJan 14, 2024 · > com.android.tools.r8.CompilationFailedException: Compilation failed to complete * Try: Run with --stacktrace option to get the stack trace. Run with --info or - …

WebIf gradle --version works, but all of your builds fail with the same error, it is possible there is a problem with one of your Gradle build configuration scripts. You can verify the problem is with Gradle scripts by running … WebOct 4, 2024 · buildozer kivy build failled: armeabi-v7a gradlew failed 394 views Jena Oct 4, 2024, 9:42:51 AM to Kivy development I am trying to build for kivy in ubuntu. The …

WebMar 4, 2024 · I can update my bind server with nsupdate when I start my script directly from the terminal. However when I start the script it from inside openvpn then I get a time out error: Communication with 1xx.xxx.x.x#53 failed: timed out. The key is found. The port 53 is open for udp and tcp. In my named.conf I tried the option listen-on port 53 { any; };.

WebMay 16, 2024 · Yes, the log says it is not able to connect to a localhost service, am getting this message when I apply command like bash gradlew clean test, below is the step … order groceries for pickup near meWebGradle fails on build I'm pushing apk to test it on Android and gradle is failing: [DEBUG]:FAILURE: Build failed with an exception. * What went wrong: Execution failed for task ':packageDebug'. > org.gradle.tooling.BuildException (no error message) * Try: Run with --stacktrace option to get the stack trace. order groceries from food lionWeb从root运行 subapp1 子项目中的 MyTest test的命令是:. ./gradlew subapp1:test --tests MyTest. 编辑:混淆的来源是:. 运行 ./gradlew -q projects 时,Gradle报告子项目时会使 … order groceries heb pickupWebMicrosoft Windows users. In File Explorer right-click on the This PC (or Computer) icon, then click Properties-> Advanced System Settings-> Environmental Variables.. Under System … order groceries for pickupWebNov 30, 2024 · Expected Behavior The build is expected to run and complete successfully and generate a native image of the example application provided by micronaut launch Actual Behaviour When running the ./gradlew buildNativeLambda command locally I ... iready writingWebAndroid-错误:任务';的执行失败:应用程序:transformClassesWithDexForRelease';,android,android-studio,gradle,android-gradle-plugin,gradlew,Android ... iready worksheets readingWebI've set the environment variables about 90 thousand times. it just wont Effing work and I'm way too frustrated to be able to think clearly. The problem is as follows. "FAILURE: Build failed with an exception. * What went wrong: The supplied javaHome seems to be invalid. I cannot find the java executable. order groceries from aldi